Target
Mu-type opioid receptor
Ligand
BDBM50189251
Substrate
Meas. Tech.
ChEMBL_378702 (CHEMBL853450)
Ki
0.700000±n/a nM
Citation
 Crooks, PAKottayil, SGAl-Ghananeem, AMByrn, SRButterfield, DA Opiate receptor binding properties of morphine-, dihydromorphine-, and codeine 6-O-sulfate ester congeners. Bioorg Med Chem Lett 16:4291-5 (2006)  
Target
Name:
Mu-type opioid receptor
Synonyms:
M-OR-1 Mu opioid receptor OPIATE Mu OPRM_CAVPO
Type:
Enzyme Catalytic Domain
Mol. Mass.:
11165.58
Organism:
GUINEA PIG
Description:
P97266
Residue:
98
  
Inhibitor
Name:
BDBM50189251
Synonyms:
CHEMBL213228 | M3P6S
Type:
Small organic molecule
Emp. Form.:
C22H27NO7S
Mol. Mass.:
449.517
SMILES:
C[NH+]1CC[C@@]23[C@H]4Oc5c2c(C[C@@H]1[C@@H]3C=C[C@@H]4OS([O-])(=O)=O)ccc5OC(=O)C(C)(C)C
: