Target
Kappa-type opioid receptor
Ligand
BDBM50189256
Substrate
Meas. Tech.
ChEMBL_378704 (CHEMBL853452)
Ki
252±n/a nM
Citation
 Crooks, PAKottayil, SGAl-Ghananeem, AMByrn, SRButterfield, DA Opiate receptor binding properties of morphine-, dihydromorphine-, and codeine 6-O-sulfate ester congeners. Bioorg Med Chem Lett 16:4291-5 (2006)  
Target
Name:
Kappa-type opioid receptor
Synonyms:
Kappa Opioid Receptor OPRK1 Opiate Kappa 1 | mu/kappa opioid receptor
Type:
G Protein-Coupled Receptor (GPCR)
Mol. Mass.:
42744.99
Organism:
Cavia porcellus (domestic guinea pig)
Description:
P41144
Residue:
380
  
Inhibitor
Name:
BDBM50189256
Synonyms:
CHEMBL385048 | M3Pr6S
Type:
Small organic molecule
Emp. Form.:
C20H23NO7S
Mol. Mass.:
421.464
SMILES:
CCC(=O)Oc1ccc2C[C@@H]3[C@@H]4C=C[C@H](OS([O-])(=O)=O)[C@@H]5Oc1c2[C@]45CC[NH+]3C
: