Target
Melanin-concentrating hormone receptor 1
Ligand
BDBM50188840
Substrate
Meas. Tech.
ChEMBL_388718 (CHEMBL865483)
Ki
7.1±n/a nM
Citation
 Dyck, BZhao, LTamiya, JPontillo, JHudson, SChing, BHeise, CEWen, JNorton, CMadan, ASchwarz, DWade, WGoodfellow, VS Substituted chromones and quinolones as potent melanin-concentrating hormone receptor 1 antagonists. Bioorg Med Chem Lett 16:4237-42 (2006)  
Target
Name:
Melanin-concentrating hormone receptor 1
Synonyms:
G-protein coupled receptor 24 MCH receptor 1 MCH-R1 MCHR-1 MCHR1_HUMAN Melanin-Concentrating Hormone Receptor 1 (MCH1R) Melanin-concentrating hormone receptor 1 (MCH-1) Melanin-concentrating hormone receptor 1 (MCHR-1) SLC-1 Somatostatin receptor-like protein
Type:
G Protein-Coupled Receptor (GPCR)
Mol. Mass.:
45976.27
Organism:
Homo sapiens (Human)
Description:
Membranes from CHO-K1 cells stably expressing human MCH1R were used in assays.
Residue:
422
  
Inhibitor
Name:
BDBM50188840
Synonyms:
7-(4-chloro-2-methylphenyl)-3-(6-(3-(dimethylamino)pyrrolidin-1-yl)pyridin-3-yl)-4H-chromen-4-one | CHEMBL214221
Type:
Small organic molecule
Emp. Form.:
C27H26ClN3O2
Mol. Mass.:
459.967
SMILES:
CN(C)C1CCN(C1)c1ccc(cn1)-c1coc2cc(ccc2c1=O)-c1ccc(Cl)cc1C
: