Target
Mineralocorticoid receptor
Ligand
BDBM50201084
Substrate
Meas. Tech.
ChEMBL_423018 (CHEMBL909351)
IC50
>2000±n/a nM
Citation
 Regan, JLee, TWZindell, RMBekkali, YBentzien, JGilmore, THammach, AKirrane, TMKukulka, AJKuzmich, DNelson, RMProudfoot, JRRalph, MPelletier, JSouza, DZuvela-Jelaska, LNabozny, GThomson, DS Quinol-4-ones as steroid A-ring mimetics in nonsteroidal dissociated glucocorticoid agonists. J Med Chem 49:7887-96 (2006)  
Target
Name:
Mineralocorticoid receptor
Synonyms:
MCR MLR NR3C2 | Nuclear receptor subfamily 3 group C member 2
Type:
Enzyme
Mol. Mass.:
107076.42
Organism:
Homo sapiens (Human)
Description:
P08235
Residue:
984
  
Inhibitor
Name:
BDBM50201084
Synonyms:
1-[4-(5-fluoro-2-methoxyphenyl)-2-hydroxy-4-methyl-2-(trifluoromethyl)pentyl]-1H-quinazolin-4-one | CHEMBL219068
Type:
Small organic molecule
Emp. Form.:
C22H22F4N2O3
Mol. Mass.:
438.4153
SMILES:
COc1ccc(F)cc1C(C)(C)CC(O)(Cn1cnc(=O)c2ccccc12)C(F)(F)F
: