Target
L-selectin
Ligand
BDBM50205368
Substrate
Meas. Tech.
ChEMBL_428319 (CHEMBL917097)
IC50
1100±n/a nM
Citation
 Kranich, RBusemann, ASBock, DSchroeter-Maas, SBeyer, DHeinemann, BMeyer, MSchierhorn, KZahlten, RWolff, GAydt, EM Rational design of novel, potent small molecule pan-selectin antagonists. J Med Chem 50:1101-15 (2007)  
Target
Name:
L-selectin
Synonyms:
LNHR LYAM1_HUMAN SELL | Selectin
Type:
PROTEIN
Mol. Mass.:
42187.20
Organism:
Homo sapiens (Human)
Description:
ChEMBL_200000
Residue:
372
  
Inhibitor
Name:
BDBM50205368
Synonyms:
(5-{3-[(2',3',4'-trihydroxy-biphenyl-3-carbonyl)-amino]-phenyl}-thiophen-2-yl)-acetic acid | CHEMBL220720
Type:
Small organic molecule
Emp. Form.:
C25H19NO6S
Mol. Mass.:
461.486
SMILES:
OC(=O)Cc1ccc(s1)-c1cccc(NC(=O)c2cccc(c2)-c2ccc(O)c(O)c2O)c1
: