Target
Adenosine receptor A1
Ligand
BDBM50208807
Substrate
Meas. Tech.
ChEMBL_429485 (CHEMBL918607)
Ki
190±n/a nM
Citation
 Adachi, HPalaniappan, KKIvanov, AABergman, NGao, ZGJacobson, KA Structure-activity relationships of 2,N(6),5'-substituted adenosine derivatives with potent activity at the A2B adenosine receptor. J Med Chem 50:1810-27 (2007)  
Target
Name:
Adenosine receptor A1
Synonyms:
A1 adenosine receptor (hA1) AA1R_HUMAN ADORA1 Adenosine A1-receptor Adenosine receptor A1 (hA1) | Adenosine transporter (AdT)
Type:
G Protein-Coupled Receptor (GPCR)
Mol. Mass.:
36520.92
Organism:
Homo sapiens (Human)
Description:
P30542
Residue:
326
  
Inhibitor
Name:
BDBM50208807
Synonyms:
(2R,3S,4S,5R)-6-amino-5-ethylcarboxyamide-2-(3''-indolyl)-ethyloxy)-purin-9-yl)-tetrahydrofuran CHEMBL223845
Type:
Small organic molecule
Emp. Form.:
C22H25N7O5
Mol. Mass.:
467.4778
SMILES:
CCNC(=O)[C@H]1O[C@H]([C@H](O)[C@@H]1O)n1cnc2c(N)nc(OCCc3c[nH]c4ccccc34)nc12
: