Target
Adenosine receptor A2a
Ligand
BDBM50208807
Substrate
Meas. Tech.
ChEMBL_429487 (CHEMBL918609)
Ki
250±n/a nM
Citation
 Adachi, HPalaniappan, KKIvanov, AABergman, NGao, ZGJacobson, KA Structure-activity relationships of 2,N(6),5'-substituted adenosine derivatives with potent activity at the A2B adenosine receptor. J Med Chem 50:1810-27 (2007)  
Target
Name:
Adenosine receptor A2a
Synonyms:
A2A adenosine receptor (hA2A) ADENOSINE A2 ADORA2 Adenosine A2A receptor (A2AAR)
Type:
G Protein-Coupled Receptor (GPCR)
Mol. Mass.:
44716.46
Organism:
Homo sapiens (Human)
Description:
P29274
Residue:
412
  
Inhibitor
Name:
BDBM50208807
Synonyms:
(2R,3S,4S,5R)-6-amino-5-ethylcarboxyamide-2-(3''-indolyl)-ethyloxy)-purin-9-yl)-tetrahydrofuran CHEMBL223845
Type:
Small organic molecule
Emp. Form.:
C22H25N7O5
Mol. Mass.:
467.4778
SMILES:
CCNC(=O)[C@H]1O[C@H]([C@H](O)[C@@H]1O)n1cnc2c(N)nc(OCCc3c[nH]c4ccccc34)nc12
: