Target
Thymidylate kinase
Ligand
BDBM50156573
Substrate
Meas. Tech.
ChEMBL_429556 (CHEMBL919554)
Ki
13500±n/a nM
Citation
 Vanheusden, VMunier-Lehmann, HFroeyen, MBusson, RRozenski, JHerdewijn, PVan Calenbergh, S Discovery of bicyclic thymidine analogues as selective and high-affinity inhibitors of Mycobacterium tuberculosis thymidine monophosphate kinase. J Med Chem 47:6187-94 (2004)  
Target
Name:
Thymidylate kinase
Synonyms:
KTHY_MYCTU Thymidine monophosphate kinase tmk
Type:
PROTEIN
Mol. Mass.:
22636.29
Organism:
Mycobacterium tuberculosis
Description:
ChEMBL_208218
Residue:
214
  
Inhibitor
Name:
BDBM50156573
Synonyms:
1-(3-aminomethyl-2-O-,6-N-carbonyl-3-deoxy-beta-D-ribofuranosyl)thymine | CHEMBL222483
Type:
Small organic molecule
Emp. Form.:
C12H15N3O6
Mol. Mass.:
297.264
SMILES:
Cc1cn([C@@H]2O[C@H](CO)[C@H]3CNC(=O)O[C@@H]23)c(=O)[nH]c1=O
: