Target
Thymidylate kinase
Ligand
BDBM50156573
Substrate
Meas. Tech.
ChEMBL_429555 (CHEMBL919553)
Ki
1100000±n/a nM
Citation
 Vanheusden, VMunier-Lehmann, HFroeyen, MBusson, RRozenski, JHerdewijn, PVan Calenbergh, S Discovery of bicyclic thymidine analogues as selective and high-affinity inhibitors of Mycobacterium tuberculosis thymidine monophosphate kinase. J Med Chem 47:6187-94 (2004)  
Target
Name:
Thymidylate kinase
Synonyms:
CDC8 KTHY_HUMAN TYMK
Type:
PROTEIN
Mol. Mass.:
23824.09
Organism:
Homo sapiens (Human)
Description:
ChEMBL_946051
Residue:
212
  
Inhibitor
Name:
BDBM50156573
Synonyms:
1-(3-aminomethyl-2-O-,6-N-carbonyl-3-deoxy-beta-D-ribofuranosyl)thymine | CHEMBL222483
Type:
Small organic molecule
Emp. Form.:
C12H15N3O6
Mol. Mass.:
297.264
SMILES:
Cc1cn([C@@H]2O[C@H](CO)[C@H]3CNC(=O)O[C@@H]23)c(=O)[nH]c1=O
: