Target
Vascular endothelial growth factor receptor 2
Ligand
BDBM4869
Substrate
Meas. Tech.
ChEMBL_438434 (CHEMBL887535)
IC50
870±n/a nM
Citation
 Yu, HWang, ZZhang, LZhang, JHuang, Q Pharmacophore modeling and in silico screening for new KDR kinase inhibitors. Bioorg Med Chem Lett 17:2126-33 (2007)  
Target
Name:
Vascular endothelial growth factor receptor 2
Synonyms:
CD_antigen=CD309 Fetal liver kinase 1 (FLK-1) KDR Protein-tyrosine kinase receptor Flk-1 VEGFR-2 VEGFR2 Vascular Endothelial Growth Factor Receptor Kinase 2 Vascular endothelial growth factor receptor 2 (KDR) Vascular endothelial growth factor receptor 2 (VEGFR2) Vascular endothelial growth factor receptor-2 (VEGFR-2)
Type:
Receptor Tyrosine Kinase
Mol. Mass.:
151510.97
Organism:
Homo sapiens (Human)
Description:
P35968
Residue:
1356
  
Inhibitor
Name:
BDBM4869
Synonyms:
3-(4-Chloroanilino)-4,5-dimethyl-6-(4-pyridylmethyl)-pyridazine CHEMBL306707 | N-(4-chlorophenyl)-4,5-dimethyl-6-(pyridin-4-ylmethyl)pyridazin-3-amine
Type:
Small organic molecule
Emp. Form.:
C18H17ClN4
Mol. Mass.:
324.807
SMILES:
Cc1c(C)c(Nc2ccc(Cl)cc2)nnc1Cc1ccncc1
: