Target
Vascular endothelial growth factor receptor 2
Ligand
BDBM50205546
Substrate
Meas. Tech.
ChEMBL_438434 (CHEMBL887535)
IC50
4±n/a nM
Citation
 Yu, HWang, ZZhang, LZhang, JHuang, Q Pharmacophore modeling and in silico screening for new KDR kinase inhibitors. Bioorg Med Chem Lett 17:2126-33 (2007)  
Target
Name:
Vascular endothelial growth factor receptor 2
Synonyms:
CD_antigen=CD309 Fetal liver kinase 1 (FLK-1) KDR Protein-tyrosine kinase receptor Flk-1 VEGFR-2 VEGFR2 Vascular Endothelial Growth Factor Receptor Kinase 2 Vascular endothelial growth factor receptor 2 (KDR) Vascular endothelial growth factor receptor 2 (VEGFR2) Vascular endothelial growth factor receptor-2 (VEGFR-2)
Type:
Receptor Tyrosine Kinase
Mol. Mass.:
151510.97
Organism:
Homo sapiens (Human)
Description:
P35968
Residue:
1356
  
Inhibitor
Name:
BDBM50205546
Synonyms:
(Z)-3-((4-(2-carboxyethyl)-4,5,6,7-tetrahydro-1H-indol-2-yl)methylene)-2-oxoindoline-5-carboxylic acid KDR Kinase Inhibitor, 2
Type:
Small organic molecule
Emp. Form.:
C21H20N2O5
Mol. Mass.:
380.3939
SMILES:
OC(=O)CCC1CCCc2[nH]c(\C=C3/C(=O)Nc4ccc(cc34)C(O)=O)cc12
: