Target
Vascular endothelial growth factor receptor 2
Ligand
BDBM8858
Substrate
Meas. Tech.
ChEMBL_438434 (CHEMBL887535)
IC50
19±n/a nM
Citation
 Yu, HWang, ZZhang, LZhang, JHuang, Q Pharmacophore modeling and in silico screening for new KDR kinase inhibitors. Bioorg Med Chem Lett 17:2126-33 (2007)  
Target
Name:
Vascular endothelial growth factor receptor 2
Synonyms:
CD_antigen=CD309 Fetal liver kinase 1 (FLK-1) KDR Protein-tyrosine kinase receptor Flk-1 VEGFR-2 VEGFR2 Vascular Endothelial Growth Factor Receptor Kinase 2 Vascular endothelial growth factor receptor 2 (KDR) Vascular endothelial growth factor receptor 2 (VEGFR2) Vascular endothelial growth factor receptor-2 (VEGFR-2)
Type:
Receptor Tyrosine Kinase
Mol. Mass.:
151510.97
Organism:
Homo sapiens (Human)
Description:
P35968
Residue:
1356
  
Inhibitor
Name:
BDBM8858
Synonyms:
3-{4-[4-amino-6-(2-hydroxyethyl)thieno[2,3-d]pyrimidin-5-yl]phenyl}-1-(3-methylphenyl)urea N-{4-[4-Amino-6-(2-hydroxyethyl)thieno[2,3-d]pyrimidin-5-yl]phenyl}-N -(3-methylphenyl)urea | Thienopyrimidine deriv. 84
Type:
Small organic molecule
Emp. Form.:
C22H21N5O2S
Mol. Mass.:
419.499
SMILES:
Cc1cccc(NC(=O)Nc2ccc(cc2)-c2c(CCO)sc3ncnc(N)c23)c1
: