Target
Vascular endothelial growth factor receptor 2
Ligand
BDBM4882
Substrate
Meas. Tech.
ChEMBL_438434 (CHEMBL887535)
IC50
20±n/a nM
Citation
 Yu, HWang, ZZhang, LZhang, JHuang, Q Pharmacophore modeling and in silico screening for new KDR kinase inhibitors. Bioorg Med Chem Lett 17:2126-33 (2007)  
Target
Name:
Vascular endothelial growth factor receptor 2
Synonyms:
CD_antigen=CD309 Fetal liver kinase 1 (FLK-1) KDR Protein-tyrosine kinase receptor Flk-1 VEGFR-2 VEGFR2 Vascular Endothelial Growth Factor Receptor Kinase 2 Vascular endothelial growth factor receptor 2 (KDR) Vascular endothelial growth factor receptor 2 (VEGFR2) Vascular endothelial growth factor receptor-2 (VEGFR-2)
Type:
Receptor Tyrosine Kinase
Mol. Mass.:
151510.97
Organism:
Homo sapiens (Human)
Description:
P35968
Residue:
1356
  
Inhibitor
Name:
BDBM4882
Synonyms:
(Z)-3-[(3-(2-Carboxyethyl)-4-methylpyrrol-2-yl)methylidenyl]indolin-2-one CHEMBL89363 SU5402
Type:
Small organic molecule
Emp. Form.:
C17H16N2O3
Mol. Mass.:
296.3205
SMILES:
Cc1c[nH]c(\C=C2/C(=O)Nc3ccccc23)c1CCC(O)=O
: