Target
Vascular endothelial growth factor receptor 2
Ligand
BDBM4619
Substrate
Meas. Tech.
ChEMBL_438434 (CHEMBL887535)
IC50
2700±n/a nM
Citation
 Yu, HWang, ZZhang, LZhang, JHuang, Q Pharmacophore modeling and in silico screening for new KDR kinase inhibitors. Bioorg Med Chem Lett 17:2126-33 (2007)  
Target
Name:
Vascular endothelial growth factor receptor 2
Synonyms:
CD_antigen=CD309 Fetal liver kinase 1 (FLK-1) KDR Protein-tyrosine kinase receptor Flk-1 VEGFR-2 VEGFR2 Vascular Endothelial Growth Factor Receptor Kinase 2 Vascular endothelial growth factor receptor 2 (KDR) Vascular endothelial growth factor receptor 2 (VEGFR2) Vascular endothelial growth factor receptor-2 (VEGFR-2)
Type:
Receptor Tyrosine Kinase
Mol. Mass.:
151510.97
Organism:
Homo sapiens (Human)
Description:
P35968
Residue:
1356
  
Inhibitor
Name:
BDBM4619
Synonyms:
Anilinoquinazoline deriv. 2 CHEMBL150581 N-(2-fluorophenyl)-6,7-dimethoxyquinazolin-4-amine
Type:
Small organic molecule
Emp. Form.:
C16H14FN3O2
Mol. Mass.:
299.2997
SMILES:
COc1cc2ncnc(Nc3ccccc3F)c2cc1OC
: