Target
Vascular endothelial growth factor receptor 2
Ligand
BDBM8862
Substrate
Meas. Tech.
ChEMBL_438434 (CHEMBL887535)
IC50
11±n/a nM
Citation
 Yu, HWang, ZZhang, LZhang, JHuang, Q Pharmacophore modeling and in silico screening for new KDR kinase inhibitors. Bioorg Med Chem Lett 17:2126-33 (2007)  
Target
Name:
Vascular endothelial growth factor receptor 2
Synonyms:
CD_antigen=CD309 Fetal liver kinase 1 (FLK-1) KDR Protein-tyrosine kinase receptor Flk-1 VEGFR-2 VEGFR2 Vascular Endothelial Growth Factor Receptor Kinase 2 Vascular endothelial growth factor receptor 2 (KDR) Vascular endothelial growth factor receptor 2 (VEGFR2) Vascular endothelial growth factor receptor-2 (VEGFR-2)
Type:
Receptor Tyrosine Kinase
Mol. Mass.:
151510.97
Organism:
Homo sapiens (Human)
Description:
P35968
Residue:
1356
  
Inhibitor
Name:
BDBM8862
Synonyms:
3-(4-{4-aminothieno[2,3-d]pyrimidin-5-yl}-3-fluorophenyl)-1-(3-methylphenyl)urea N-[4-(4-Aminothieno[2,3-d]pyrimidin-5-yl)-3-fluoro-phenyl]N -(3-methylphenyl)urea | Thienopyrimidine deriv. 88
Type:
Small organic molecule
Emp. Form.:
C20H16FN5OS
Mol. Mass.:
393.437
SMILES:
Cc1cccc(NC(=O)Nc2ccc(-c3csc4ncnc(N)c34)c(F)c2)c1
: