Target
Vascular endothelial growth factor receptor 2
Ligand
BDBM8809
Substrate
Meas. Tech.
ChEMBL_438434 (CHEMBL887535)
IC50
4600±n/a nM
Citation
 Yu, HWang, ZZhang, LZhang, JHuang, Q Pharmacophore modeling and in silico screening for new KDR kinase inhibitors. Bioorg Med Chem Lett 17:2126-33 (2007)  
Target
Name:
Vascular endothelial growth factor receptor 2
Synonyms:
CD_antigen=CD309 Fetal liver kinase 1 (FLK-1) KDR Protein-tyrosine kinase receptor Flk-1 VEGFR-2 VEGFR2 Vascular Endothelial Growth Factor Receptor Kinase 2 Vascular endothelial growth factor receptor 2 (KDR) Vascular endothelial growth factor receptor 2 (VEGFR2) Vascular endothelial growth factor receptor-2 (VEGFR-2)
Type:
Receptor Tyrosine Kinase
Mol. Mass.:
151510.97
Organism:
Homo sapiens (Human)
Description:
P35968
Residue:
1356
  
Inhibitor
Name:
BDBM8809
Synonyms:
5-(4-Aminophenyl)-6-methylthieno[2,3-d]pyrimidin-4-amine Thienopyrimidine deriv. 6
Type:
Small organic molecule
Emp. Form.:
C13H12N4S
Mol. Mass.:
256.326
SMILES:
Cc1sc2ncnc(N)c2c1-c1ccc(N)cc1
: