Target
Vascular endothelial growth factor receptor 2
Ligand
BDBM50168415
Substrate
Meas. Tech.
ChEMBL_438434 (CHEMBL887535)
IC50
270±n/a nM
Citation
 Yu, HWang, ZZhang, LZhang, JHuang, Q Pharmacophore modeling and in silico screening for new KDR kinase inhibitors. Bioorg Med Chem Lett 17:2126-33 (2007)  
Target
Name:
Vascular endothelial growth factor receptor 2
Synonyms:
CD_antigen=CD309 Fetal liver kinase 1 (FLK-1) KDR Protein-tyrosine kinase receptor Flk-1 VEGFR-2 VEGFR2 Vascular Endothelial Growth Factor Receptor Kinase 2 Vascular endothelial growth factor receptor 2 (KDR) Vascular endothelial growth factor receptor 2 (VEGFR2) Vascular endothelial growth factor receptor-2 (VEGFR-2)
Type:
Receptor Tyrosine Kinase
Mol. Mass.:
151510.97
Organism:
Homo sapiens (Human)
Description:
P35968
Residue:
1356
  
Inhibitor
Name:
BDBM50168415
Synonyms:
5-Isopropyl-4-(3-methoxycarbamoyl-phenoxy)-pyrrolo[2,1-f][1,2,4]triazine-6-carboxylic acid ethyl ester ethyl 5-isopropyl-4-(3-(methoxycarbamoyl)phenoxy)pyrrolo[1,2-f][1,2,4]triazine-6-carboxylate
Type:
Small organic molecule
Emp. Form.:
C20H22N4O5
Mol. Mass.:
398.4125
SMILES:
CCOC(=O)c1cn2ncnc(Oc3cccc(c3)C(=O)NOC)c2c1C(C)C
: