Target
Vascular endothelial growth factor receptor 2
Ligand
BDBM8867
Substrate
Meas. Tech.
ChEMBL_438434 (CHEMBL887535)
IC50
13±n/a nM
Citation
 Yu, HWang, ZZhang, LZhang, JHuang, Q Pharmacophore modeling and in silico screening for new KDR kinase inhibitors. Bioorg Med Chem Lett 17:2126-33 (2007)  
Target
Name:
Vascular endothelial growth factor receptor 2
Synonyms:
CD_antigen=CD309 Fetal liver kinase 1 (FLK-1) KDR Protein-tyrosine kinase receptor Flk-1 VEGFR-2 VEGFR2 Vascular Endothelial Growth Factor Receptor Kinase 2 Vascular endothelial growth factor receptor 2 (KDR) Vascular endothelial growth factor receptor 2 (VEGFR2) Vascular endothelial growth factor receptor-2 (VEGFR-2)
Type:
Receptor Tyrosine Kinase
Mol. Mass.:
151510.97
Organism:
Homo sapiens (Human)
Description:
P35968
Residue:
1356
  
Inhibitor
Name:
BDBM8867
Synonyms:
3-(4-{4-aminothieno[2,3-d]pyrimidin-5-yl}-2-methoxyphenyl)-1-(3-methylphenyl)urea N-[4-(4-Aminothieno[2,3-d]pyrimidin-5-yl)-2-methoxyphenyl]-N -(3-methylphenyl)urea | Thienopyrimidine deriv. 93
Type:
Small organic molecule
Emp. Form.:
C21H19N5O2S
Mol. Mass.:
405.473
SMILES:
COc1cc(ccc1NC(=O)Nc1cccc(C)c1)-c1csc2ncnc(N)c12
: