Target
Vascular endothelial growth factor receptor 2
Ligand
BDBM4862
Substrate
Meas. Tech.
ChEMBL_438434 (CHEMBL887535)
IC50
650±n/a nM
Citation
 Yu, HWang, ZZhang, LZhang, JHuang, Q Pharmacophore modeling and in silico screening for new KDR kinase inhibitors. Bioorg Med Chem Lett 17:2126-33 (2007)  
Target
Name:
Vascular endothelial growth factor receptor 2
Synonyms:
CD_antigen=CD309 Fetal liver kinase 1 (FLK-1) KDR Protein-tyrosine kinase receptor Flk-1 VEGFR-2 VEGFR2 Vascular Endothelial Growth Factor Receptor Kinase 2 Vascular endothelial growth factor receptor 2 (KDR) Vascular endothelial growth factor receptor 2 (VEGFR2) Vascular endothelial growth factor receptor-2 (VEGFR-2)
Type:
Receptor Tyrosine Kinase
Mol. Mass.:
151510.97
Organism:
Homo sapiens (Human)
Description:
P35968
Residue:
1356
  
Inhibitor
Name:
BDBM4862
Synonyms:
1-(4-Chloroanilino)-4-(4-pyridylmethyl)-7-aminophthalazine CGP79787 Analog 45 | CHEMBL74143
Type:
Small organic molecule
Emp. Form.:
C20H16ClN5
Mol. Mass.:
361.828
SMILES:
Nc1ccc2c(Cc3ccncc3)nnc(Nc3ccc(Cl)cc3)c2c1
: