Target
Vascular endothelial growth factor receptor 2
Ligand
BDBM4628
Substrate
Meas. Tech.
ChEMBL_438434 (CHEMBL887535)
IC50
7±n/a nM
Citation
 Yu, HWang, ZZhang, LZhang, JHuang, Q Pharmacophore modeling and in silico screening for new KDR kinase inhibitors. Bioorg Med Chem Lett 17:2126-33 (2007)  
Target
Name:
Vascular endothelial growth factor receptor 2
Synonyms:
CD_antigen=CD309 Fetal liver kinase 1 (FLK-1) KDR Protein-tyrosine kinase receptor Flk-1 VEGFR-2 VEGFR2 Vascular Endothelial Growth Factor Receptor Kinase 2 Vascular endothelial growth factor receptor 2 (KDR) Vascular endothelial growth factor receptor 2 (VEGFR2) Vascular endothelial growth factor receptor-2 (VEGFR-2)
Type:
Receptor Tyrosine Kinase
Mol. Mass.:
151510.97
Organism:
Homo sapiens (Human)
Description:
P35968
Residue:
1356
  
Inhibitor
Name:
BDBM4628
Synonyms:
Anilinoquinazoline deriv. 11 KDR Kinase Inhibitor, 10 N-(4-chloro-2-fluorophenyl)-6-methoxy-7-(2-methoxyethoxy)quinazolin-4-amine
Type:
Small organic molecule
Emp. Form.:
C18H17ClFN3O3
Mol. Mass.:
377.797
SMILES:
COCCOc1cc2ncnc(Nc3ccc(Cl)cc3F)c2cc1OC
: