Target
Vascular endothelial growth factor receptor 2
Ligand
BDBM50205550
Substrate
Meas. Tech.
ChEMBL_438434 (CHEMBL887535)
IC50
1000±n/a nM
Citation
 Yu, HWang, ZZhang, LZhang, JHuang, Q Pharmacophore modeling and in silico screening for new KDR kinase inhibitors. Bioorg Med Chem Lett 17:2126-33 (2007)  
Target
Name:
Vascular endothelial growth factor receptor 2
Synonyms:
CD_antigen=CD309 Fetal liver kinase 1 (FLK-1) KDR Protein-tyrosine kinase receptor Flk-1 VEGFR-2 VEGFR2 Vascular Endothelial Growth Factor Receptor Kinase 2 Vascular endothelial growth factor receptor 2 (KDR) Vascular endothelial growth factor receptor 2 (VEGFR2) Vascular endothelial growth factor receptor-2 (VEGFR-2)
Type:
Receptor Tyrosine Kinase
Mol. Mass.:
151510.97
Organism:
Homo sapiens (Human)
Description:
P35968
Residue:
1356
  
Inhibitor
Name:
BDBM50205550
Synonyms:
8-methyl-4H,7H-indolo[6,5,4-cd]indol-5-one | CHEMBL388936
Type:
Small organic molecule
Emp. Form.:
C14H10N2O
Mol. Mass.:
222.242
SMILES:
Cc1cc2c(cc3C(=O)Nc4cccc2c34)[nH]1
: