Target
Vascular endothelial growth factor receptor 2
Ligand
BDBM50205552
Substrate
Meas. Tech.
ChEMBL_438434 (CHEMBL887535)
IC50
60±n/a nM
Citation
 Yu, HWang, ZZhang, LZhang, JHuang, Q Pharmacophore modeling and in silico screening for new KDR kinase inhibitors. Bioorg Med Chem Lett 17:2126-33 (2007)  
Target
Name:
Vascular endothelial growth factor receptor 2
Synonyms:
CD_antigen=CD309 Fetal liver kinase 1 (FLK-1) KDR Protein-tyrosine kinase receptor Flk-1 VEGFR-2 VEGFR2 Vascular Endothelial Growth Factor Receptor Kinase 2 Vascular endothelial growth factor receptor 2 (KDR) Vascular endothelial growth factor receptor 2 (VEGFR2) Vascular endothelial growth factor receptor-2 (VEGFR-2)
Type:
Receptor Tyrosine Kinase
Mol. Mass.:
151510.97
Organism:
Homo sapiens (Human)
Description:
P35968
Residue:
1356
  
Inhibitor
Name:
BDBM50205552
Synonyms:
5-(6,7-bis(2-methoxyethoxy)quinazolin-4-ylamino)-2-chloro-4-fluorophenol | CHEMBL396219
Type:
Small organic molecule
Emp. Form.:
C20H21ClFN3O5
Mol. Mass.:
437.849
SMILES:
COCCOc1cc2ncnc(Nc3cc(O)c(Cl)cc3F)c2cc1OCCOC
: