Target
Vascular endothelial growth factor receptor 2
Ligand
BDBM50205554
Substrate
Meas. Tech.
ChEMBL_438434 (CHEMBL887535)
IC50
150±n/a nM
Citation
 Yu, HWang, ZZhang, LZhang, JHuang, Q Pharmacophore modeling and in silico screening for new KDR kinase inhibitors. Bioorg Med Chem Lett 17:2126-33 (2007)  
Target
Name:
Vascular endothelial growth factor receptor 2
Synonyms:
CD_antigen=CD309 Fetal liver kinase 1 (FLK-1) KDR Protein-tyrosine kinase receptor Flk-1 VEGFR-2 VEGFR2 Vascular Endothelial Growth Factor Receptor Kinase 2 Vascular endothelial growth factor receptor 2 (KDR) Vascular endothelial growth factor receptor 2 (VEGFR2) Vascular endothelial growth factor receptor-2 (VEGFR-2)
Type:
Receptor Tyrosine Kinase
Mol. Mass.:
151510.97
Organism:
Homo sapiens (Human)
Description:
P35968
Residue:
1356
  
Inhibitor
Name:
BDBM50205554
Synonyms:
2-chloro-4-fluoro-5-(7-(2-methoxyethoxy)quinazolin-4-ylamino)phenol | CHEMBL231650
Type:
Small organic molecule
Emp. Form.:
C17H15ClFN3O3
Mol. Mass.:
363.771
SMILES:
COCCOc1ccc2c(Nc3cc(O)c(Cl)cc3F)ncnc2c1
: