Target
Vascular endothelial growth factor receptor 2
Ligand
BDBM50205556
Substrate
Meas. Tech.
ChEMBL_438434 (CHEMBL887535)
IC50
31000±n/a nM
Citation
 Yu, HWang, ZZhang, LZhang, JHuang, Q Pharmacophore modeling and in silico screening for new KDR kinase inhibitors. Bioorg Med Chem Lett 17:2126-33 (2007)  
Target
Name:
Vascular endothelial growth factor receptor 2
Synonyms:
CD_antigen=CD309 Fetal liver kinase 1 (FLK-1) KDR Protein-tyrosine kinase receptor Flk-1 VEGFR-2 VEGFR2 Vascular Endothelial Growth Factor Receptor Kinase 2 Vascular endothelial growth factor receptor 2 (KDR) Vascular endothelial growth factor receptor 2 (VEGFR2) Vascular endothelial growth factor receptor-2 (VEGFR-2)
Type:
Receptor Tyrosine Kinase
Mol. Mass.:
151510.97
Organism:
Homo sapiens (Human)
Description:
P35968
Residue:
1356
  
Inhibitor
Name:
BDBM50205556
Synonyms:
3-((1H-pyrrol-2-yl)methylene)-4-methylindolin-2-one | CHEMBL396788
Type:
Small organic molecule
Emp. Form.:
C14H12N2O
Mol. Mass.:
224.2579
SMILES:
Cc1cccc2NC(=O)\C(=C\c3ccc[nH]3)c12
: