Target
Nociceptin receptor
Ligand
BDBM50210415
Substrate
Meas. Tech.
ChEMBL_438633 (CHEMBL888964)
Ki
6±n/a nM
Citation
 Ho, GDBercovici, ATulshian, DGreenlee, WJFawzi, ASmith Torhan, AZhang, H Synthesis and structure-activity relationships of 4-hydroxy-4-phenylpiperidines as nociceptin receptor ligands: Part 1. Bioorg Med Chem Lett 17:3023-7 (2007)  
Target
Name:
Nociceptin receptor
Synonyms:
KOR-3 Mu-type opioid receptor (Mu) Nociceptin Receptor (ORL1 Receptor) Nociceptin receptor (ORL-1) Nociceptin/Orphanin FQ, NOP receptor OPIATE ORL-1 OPRL1 protein ORL1 Opioid receptor like-1 Orphanin FQ receptor (ORL1) | P41146
Type:
G Protein-Coupled Receptor (GPCR)
Mol. Mass.:
40702.87
Organism:
Homo sapiens (Human)
Description:
P41146
Residue:
370
  
Inhibitor
Name:
BDBM50210415
Synonyms:
1-(bis(2-fluorophenyl)methyl)-4-phenylpiperidin-4-ol | CHEMBL228912
Type:
Small organic molecule
Emp. Form.:
C24H23F2NO
Mol. Mass.:
379.4423
SMILES:
OC1(CCN(CC1)C(c1ccccc1F)c1ccccc1F)c1ccccc1
: