Target
Kappa-type opioid receptor
Ligand
BDBM50210415
Substrate
Meas. Tech.
ChEMBL_438623 (CHEMBL888954)
Ki
1172±n/a nM
Citation
 Ho, GDBercovici, ATulshian, DGreenlee, WJFawzi, ASmith Torhan, AZhang, H Synthesis and structure-activity relationships of 4-hydroxy-4-phenylpiperidines as nociceptin receptor ligands: Part 1. Bioorg Med Chem Lett 17:3023-7 (2007)  
Target
Name:
Kappa-type opioid receptor
Synonyms:
K-OR-1 Kappa-opioid receptor (KOR) Kappa-type opioid receptor (KOR) OPIATE Kappa OPRK1 kappa opioid receptor (KOR)
Type:
G Protein-Coupled Receptor (GPCR)
Mol. Mass.:
42648.76
Organism:
Homo sapiens (Human)
Description:
P41145
Residue:
380
  
Inhibitor
Name:
BDBM50210415
Synonyms:
1-(bis(2-fluorophenyl)methyl)-4-phenylpiperidin-4-ol | CHEMBL228912
Type:
Small organic molecule
Emp. Form.:
C24H23F2NO
Mol. Mass.:
379.4423
SMILES:
OC1(CCN(CC1)C(c1ccccc1F)c1ccccc1F)c1ccccc1
: