Target
Carbonic anhydrase 14
Ligand
BDBM12918
Substrate
Meas. Tech.
ChEMBL_441220 (CHEMBL891444)
Ki
11±n/a nM
Citation
 Wilkinson, BLBornaghi, LFHouston, TAInnocenti, AVullo, DSupuran, CTPoulsen, SA Inhibition of membrane-associated carbonic anhydrase isozymes IX, XII and XIV with a library of glycoconjugate benzenesulfonamides. Bioorg Med Chem Lett 17:987-92 (2007)  
Target
Name:
Carbonic anhydrase 14
Synonyms:
CA-XIV CAH14_HUMAN Carbonic Anhydrase XIV Carbonic anhydrase 14 Carbonic anhydrase XIV (CA XIV)
Type:
Enzyme
Mol. Mass.:
37665.67
Organism:
Homo sapiens (Human)
Description:
Human (cloned) isozyme.
Residue:
337
  
Inhibitor
Name:
BDBM12918
Synonyms:
4-({[4-(Aminosulfonyl)benzoyl]amino}methyl-1-(2,3,4,6-tetra-O-acetyl-beta-D-glucopyranosyl)-1H-1,2,3-triazole Glycoconjugate Benzene Sulfonamide 2a | [(2R,3R,4S,5R,6R)-3,4,5-tris(acetyloxy)-6-(4-{[(4-sulfamoylphenyl)formamido]methyl}-1H-1,2,3-triazol-1-yl)oxan-2-yl]methyl acetate
Type:
Small organic molecule
Emp. Form.:
C24H29N5O12S
Mol. Mass.:
611.578
SMILES:
CC(=O)OC[C@H]1O[C@H]([C@H](OC(C)=O)[C@@H](OC(C)=O)[C@@H]1OC(C)=O)n1cc(CNC(=O)c2ccc(cc2)S(N)(=O)=O)nn1
: