Target
Carbonic anhydrase 12
Ligand
BDBM12942
Substrate
Meas. Tech.
ChEMBL_441219 (CHEMBL891443)
Ki
8±n/a nM
Citation
 Wilkinson, BLBornaghi, LFHouston, TAInnocenti, AVullo, DSupuran, CTPoulsen, SA Inhibition of membrane-associated carbonic anhydrase isozymes IX, XII and XIV with a library of glycoconjugate benzenesulfonamides. Bioorg Med Chem Lett 17:987-92 (2007)  
Target
Name:
Carbonic anhydrase 12
Synonyms:
CA-XII CAH12_HUMAN Carbonic anhydrase Carbonic anhydrase XII Carbonic anhydrase XII (CAXII) | Tumor antigen HOM-RCC-3.1.3
Type:
Enzyme
Mol. Mass.:
39456.00
Organism:
Homo sapiens (Human)
Description:
Catalytic domain of human cloned isozyme was used in the assay
Residue:
354
  
Inhibitor
Name:
BDBM12942
Synonyms:
(2R,3R,4S,5R,6S)-4,5-bis(acetyloxy)-6-methoxy-2-[(4-{[(4-sulfamoylphenyl)formamido]methyl}-1H-1,2,3-triazol-1-yl)methyl]oxan-3-yl acetate Glycoconjugate Benzene Sulfonamide 2g | Methyl 2,3,4-tri-O-acetyl-6-[4-({[aminosulfonyl)benzoyl]-amino}methyl)-1H-1,2,3-triazol-1-yl]-6-deoxy-alpha-D-glucopyranoside
Type:
Small organic molecule
Emp. Form.:
C23H29N5O11S
Mol. Mass.:
583.568
SMILES:
CO[C@H]1O[C@H](Cn2cc(CNC(=O)c3ccc(cc3)S(N)(=O)=O)nn2)[C@@H](OC(C)=O)[C@H](OC(C)=O)[C@H]1OC(C)=O
: