Target
Carbonic anhydrase 14
Ligand
BDBM12937
Substrate
Meas. Tech.
ChEMBL_441220 (CHEMBL891444)
Ki
10.8±n/a nM
Citation
 Wilkinson, BLBornaghi, LFHouston, TAInnocenti, AVullo, DSupuran, CTPoulsen, SA Inhibition of membrane-associated carbonic anhydrase isozymes IX, XII and XIV with a library of glycoconjugate benzenesulfonamides. Bioorg Med Chem Lett 17:987-92 (2007)  
Target
Name:
Carbonic anhydrase 14
Synonyms:
CA-XIV CAH14_HUMAN Carbonic Anhydrase XIV Carbonic anhydrase 14 Carbonic anhydrase XIV (CA XIV)
Type:
Enzyme
Mol. Mass.:
37665.67
Organism:
Homo sapiens (Human)
Description:
Human (cloned) isozyme.
Residue:
337
  
Inhibitor
Name:
BDBM12937
Synonyms:
4-({[4-(Aminosulfonyl)benzoyl]oxy}methyl-1-(beta-D-glucuronic acid methyl ester)-1H-1,2,3-triazole Glycoconjugate Benzene Sulfonamide 3ee | methyl (2S,3S,4S,5R,6R)-3,4,5-trihydroxy-6-(4-{[(4-sulfamoylphenyl)carbonyloxy]methyl}-1H-1,2,3-triazol-1-yl)oxane-2-carboxylate
Type:
Small organic molecule
Emp. Form.:
C17H20N4O10S
Mol. Mass.:
472.427
SMILES:
COC(=O)[C@H]1O[C@H]([C@H](O)[C@@H](O)[C@@H]1O)n1cc(COC(=O)c2ccc(cc2)S(N)(=O)=O)nn1
: