Target
Vasopressin V1a receptor
Ligand
BDBM50221813
Substrate
Meas. Tech.
ChEMBL_446250 (CHEMBL895355)
Ki
0.21±n/a nM
Citation
 Albizu, LTeppaz, GSeyer, RBazin, HAnsanay, HManning, MMouillac, BDurroux, T Toward efficient drug screening by homogeneous assays based on the development of new fluorescent vasopressin and oxytocin receptor ligands. J Med Chem 50:4976-85 (2007)  
Target
Name:
Vasopressin V1a receptor
Synonyms:
AVPR V1a AVPR1A V1AR_HUMAN VASOPRESSIN V1A Vasopressin V1 receptor Vasopressin receptor
Type:
Receptor
Mol. Mass.:
46820.18
Organism:
Homo sapiens (Human)
Description:
P37288
Residue:
418
  
Inhibitor
Name:
BDBM50221813
Synonyms:
CHEMBL394602 | HO-LVA
Type:
Small organic molecule
Emp. Form.:
C53H74N16O12
Mol. Mass.:
1127.2547
SMILES:
[#6]-[#7](-[#6@H](-[#6]-c1ccc(-[#8])cc1)-[#6](=O)-[#7]-[#6@@H](-[#6]-c1ccccc1)-[#6](=O)-[#7]-[#6@@H](-[#6]-[#6]-[#6](-[#7])=O)-[#6](=O)-[#7]-[#6@@H](-[#6]-[#6](-[#7])=O)-[#6](=O)-[#7]-[#6@@H](-[#6]-[#6]-[#6]\[#7]=[#6](\[#7])-[#7])-[#6](=O)-[#7]-1-[#6]-[#6]-[#6@@H](-[#6]-1)-[#6](=O)-[#7]-[#6@@H](-[#6]-[#6]-[#6]\[#7]=[#6](\[#7])-[#7])-[#6](-[#7])=O)-[#6](=O)-[#6]-c1ccc(-[#8])cc1
: