Target
Cytochrome P450 2D6
Ligand
BDBM50222869
Substrate
Meas. Tech.
ChEMBL_446535 (CHEMBL896832)
IC50
13000±n/a nM
Citation
 Rudolph, JEsler, WPO'connor, SCoish, PDWickens, PLBrands, MBierer, DEBloomquist, BTBondar, GChen, LChuang, CYClaus, THFathi, ZFu, WKhire, URKristie, JALiu, XGLowe, DBMcClure, ACMichels, MOrtiz, AARamsden, PDSchoenleber, RWShelekhin, TEVakalopoulos, ATang, WWang, LYi, LGardell, SJLivingston, JNSweet, LJBullock, WH Quinazolinone derivatives as orally available ghrelin receptor antagonists for the treatment of diabetes and obesity. J Med Chem 50:5202-16 (2007)  
Target
Name:
Cytochrome P450 2D6
Synonyms:
CP2D6_HUMAN CYP2DL1 Cytochrome P450 2D6 (CYP2D6) P450-DB1
Type:
Protein
Mol. Mass.:
55774.82
Organism:
Homo sapiens (Human)
Description:
P10635
Residue:
497
  
Inhibitor
Name:
BDBM50222869
Synonyms:
6-(4-fluorophenoxy)-3-{[(3S)-1-isopropylpiperidin-3-yl]methyl}-2-methylquinazolin-4(3H)-one | CHEMBL243001
Type:
Small organic molecule
Emp. Form.:
C24H28FN3O2
Mol. Mass.:
409.4964
SMILES:
CC(C)N1CCC[C@H](Cn2c(C)nc3ccc(Oc4ccc(F)cc4)cc3c2=O)C1
: