Target
Delta-type opioid receptor
Ligand
BDBM50027241
Substrate
Meas. Tech.
ChEMBL_446659 (CHEMBL896954)
Ki
133±n/a nM
Citation
 Rennison, DNeal, APCami-Kobeci, GAceto, MDMartinez-Bermejo, FLewis, JWHusbands, SM Cinnamoyl derivatives of 7alpha-aminomethyl-6,14-endo-ethanotetrahydrothebaine and 7alpha-aminomethyl-6,14-endo-ethanotetrahydrooripavine and related opioid ligands. J Med Chem 50:5176-82 (2007)  
Target
Name:
Delta-type opioid receptor
Synonyms:
D-OR-1 Delta opioid receptor OPIATE Delta OPRD1 OPRK1 | opioid receptor, delta 1
Type:
G Protein-Coupled Receptor (GPCR)
Mol. Mass.:
40382.98
Organism:
Homo sapiens (Human)
Description:
Competition binding assays were carried out using membrane preparations from transfected HN9.10 cells that constitutively expressed the delta opioid receptor.
Residue:
372
  
Inhibitor
Name:
BDBM50027241
Synonyms:
CHEMBL2113299
Type:
Small organic molecule
Emp. Form.:
C31H35N3O6
Mol. Mass.:
545.6261
SMILES:
[H][C@@]12Oc3c4c(C[C@@]5([H])N(C)CC[C@@]14[C@@]51CC[C@]2(OC)[C@@H](CNC(=O)\C=C\c2ccc(cc2)[N+]([O-])=O)C1)ccc3OC
: