Target
72 kDa type IV collagenase
Ligand
BDBM50225403
Substrate
Meas. Tech.
ChEMBL_451365 (CHEMBL901568)
IC50
20000±n/a nM
Citation
 Wagner, SBreyholz, HJLaw, MPFaust, AHöltke, CSchröer, SHaufe, GLevkau, BSchober, OSchäfers, MKopka, K Novel fluorinated derivatives of the broad-spectrum MMP inhibitors N-hydroxy-2(R)-[[(4-methoxyphenyl)sulfonyl](benzyl)- and (3-picolyl)-amino]-3-methyl-butanamide as potential tools for the molecular imaging of activated MMPs with PET. J Med Chem 50:5752-64 (2007)  
Target
Name:
72 kDa type IV collagenase
Synonyms:
72 kDa gelatinase CLG4A Gelatinase A (MMP-2) MMP2_HUMAN Matrix metalloproteinase-2 (MMP 2) Matrix metalloproteinases 2 (MMP-2) | TBE-1
Type:
Enzyme
Mol. Mass.:
73870.36
Organism:
Homo sapiens (Human)
Description:
P08253
Residue:
660
  
Inhibitor
Name:
BDBM50225403
Synonyms:
(R)-2-(N-((2-fluoropyridin-3-yl)methyl)-4-methoxyphenylsulphonamido)-3-methylbutanoic acid | CHEMBL428554
Type:
Small organic molecule
Emp. Form.:
C18H21FN2O5S
Mol. Mass.:
396.433
SMILES:
COc1ccc(cc1)S(=O)(=O)N(Cc1cccnc1F)[C@H](C(C)C)C(O)=O
: