Target
5-hydroxytryptamine receptor 2A
Ligand
BDBM50205787
Substrate
Meas. Tech.
ChEMBL_454643 (CHEMBL886663)
Ki
0.19±n/a nM
Citation
 Wilson, KJvan Niel, MBCooper, LBloomfield, DO'Connor, DFish, LRMacLeod, AM 2,5-Disubstituted pyridines: the discovery of a novel series of 5-HT2A ligands. Bioorg Med Chem Lett 17:2643-8 (2007)  
Target
Name:
5-hydroxytryptamine receptor 2A
Synonyms:
5-HT-2 5-HT2A 5-hydroxytryptamine receptor 2A (5HT-2A) 5HT2A_HUMAN HTR2A | Serotonin receptor 2A
Type:
undefined
Mol. Mass.:
52607.65
Organism:
Homo sapiens (Human)
Description:
P28223
Residue:
471
  
Inhibitor
Name:
BDBM50205787
Synonyms:
(E)-5-fluoro-2-(2-(5-(2-fluorophenylsulfonyl)pyridin-2-yl)vinyl)phenol | CHEMBL240876
Type:
Small organic molecule
Emp. Form.:
C19H13F2NO3S
Mol. Mass.:
373.373
SMILES:
Oc1cc(F)ccc1\C=C\c1ccc(cn1)S(=O)(=O)c1ccccc1F
: