Target
Muscarinic acetylcholine receptor M2
Ligand
BDBM50218056
Substrate
Meas. Tech.
ChEMBL_457003 (CHEMBL923346)
Ki
537±n/a nM
Citation
 Kumar, NKaur, KAeron, SDharmarajan, SSilamkoti, ADMehta, AGupta, SChugh, AGupta, JBSalman, MPalle, VPCliffe, IA Synthesis and optimization of novel and selective muscarinic M(3) receptor antagonists. Bioorg Med Chem Lett 17:5256-60 (2007)  
Target
Name:
Muscarinic acetylcholine receptor M2
Synonyms:
ACM2_RAT Chrm-2 | Chrm2
Type:
Enzyme Catalytic Domain
Mol. Mass.:
51555.53
Organism:
RAT
Description:
P10980
Residue:
466
  
Inhibitor
Name:
BDBM50218056
Synonyms:
CHEMBL249204 | methyl 4-(2-((1S,5R,6s)-6-((R)-2-cyclopentyl-2-hydroxy-2-phenylacetamido)-3-aza-bicyclo[3.1.0]hexan-3-yl)ethyl)benzoate
Type:
Small organic molecule
Emp. Form.:
C28H34N2O4
Mol. Mass.:
462.5806
SMILES:
COC(=O)c1ccc(CCN2C[C@H]3[C@@H](C2)[C@@H]3NC(=O)C(O)(C2CCCC2)c2ccccc2)cc1
: