Target
Androgen receptor
Ligand
BDBM50223236
Substrate
Meas. Tech.
ChEMBL_458140 (CHEMBL925473)
IC50
170±n/a nM
Citation
 Blizzard, TAGude, CMorgan, JDChan, WBirzin, ETMojena, MTudela, CChen, FKnecht, KSu, QKraker, BMosley, RTHolmes, MARohrer, SPHammond, ML Androstene-3,5-dienes as ER-beta selective SERMs. Bioorg Med Chem Lett 17:6295-8 (2007)  
Target
Name:
Androgen receptor
Synonyms:
ANDR_HUMAN Androgen Receptor Androgen receptor/Baculoviral IAP repeat-containing protein 2 Dihydrotestosterone receptor Nuclear receptor subfamily 3 group C member 4
Type:
Receptor
Mol. Mass.:
99185.27
Organism:
Homo sapiens (Human)
Description:
CHO cells were stably transfected with human AR gene.
Residue:
920
  
Inhibitor
Name:
BDBM50223236
Synonyms:
(3S,8R,9S,10S,13S,14S,17S)-13,17-dimethyl-10-vinyl-2,3,4,7,8,9,10,11,12,13,14,15,16,17-tetradecahydro-1H-cyclopenta[a]phenanthrene-3,17-diol | CHEMBL250109
Type:
Small organic molecule
Emp. Form.:
C21H32O2
Mol. Mass.:
316.4776
SMILES:
C[C@]1(O)CC[C@H]2[C@@H]3CC=C4C[C@@H](O)CC[C@]4(C=C)[C@H]3CC[C@]12C
: