Target
Kinesin-like protein KIF11
Ligand
BDBM24060
Substrate
Meas. Tech.
ChEMBL_458813 (CHEMBL942113)
IC50
2±n/a nM
Citation
 Liu, FYou, QDChen, YD Pharmacophore identification of KSP inhibitors. Bioorg Med Chem Lett 17:722-6 (2007)  
Target
Name:
Kinesin-like protein KIF11
Synonyms:
EG5 KIF11_HUMAN Kinesin Spindle Protein Eg5 TRIP5 | kinesin spindle protein
Type:
PROTEIN
Mol. Mass.:
119138.97
Organism:
Homo sapiens (Human)
Description:
ChEMBL_1457426
Residue:
1056
  
Inhibitor
Name:
BDBM24060
Synonyms:
(2S)-2-amino-2-cyclopropyl-1-[(2S)-4-(2,5-difluorophenyl)-2-phenyl-2,5-dihydro-1H-pyrrol-1-yl]ethan-1-one dihydropyrrole, 19
Type:
Small organic molecule
Emp. Form.:
C21H20F2N2O
Mol. Mass.:
354.3931
SMILES:
[H][C@]1(C=C(CN1C(=O)[C@@H](N)C1CC1)c1cc(F)ccc1F)c1ccccc1
: