Target
72 kDa type IV collagenase
Ligand
BDBM50227536
Substrate
Meas. Tech.
ChEMBL_459969 (CHEMBL943097)
IC50
>150000±n/a nM
Citation
 Hayashi, RJin, XCook, GR Synthesis and evaluation of novel heterocyclic MMP inhibitors. Bioorg Med Chem Lett 17:6864-70 (2008)  
Target
Name:
72 kDa type IV collagenase
Synonyms:
72 kDa gelatinase CLG4A Gelatinase A (MMP-2) MMP2_HUMAN Matrix metalloproteinase-2 (MMP 2) Matrix metalloproteinases 2 (MMP-2) | TBE-1
Type:
Enzyme
Mol. Mass.:
73870.36
Organism:
Homo sapiens (Human)
Description:
P08253
Residue:
660
  
Inhibitor
Name:
BDBM50227536
Synonyms:
4-(4,5-dihydrooxazol-2-yl)-1-(3-phenylpropyl)-1H-1,2,3-triazole | CHEMBL249863
Type:
Small organic molecule
Emp. Form.:
C14H16N4O
Mol. Mass.:
256.303
SMILES:
C(Cc1ccccc1)Cn1cc(nn1)C1=NCCO1
: