Target
Macrophage metalloelastase
Ligand
BDBM50227536
Substrate
Meas. Tech.
ChEMBL_459971 (CHEMBL943099)
IC50
>150000±n/a nM
Citation
 Hayashi, RJin, XCook, GR Synthesis and evaluation of novel heterocyclic MMP inhibitors. Bioorg Med Chem Lett 17:6864-70 (2008)  
Target
Name:
Macrophage metalloelastase
Synonyms:
HME MMP12_HUMAN Matrix metalloproteinase-12 (MMP 12) Matrix metalloproteinase-12 (MMP12) | Matrix metalloproteinases 12 (MMP-12)
Type:
Enzyme
Mol. Mass.:
54012.99
Organism:
Homo sapiens (Human)
Description:
P39900
Residue:
470
  
Inhibitor
Name:
BDBM50227536
Synonyms:
4-(4,5-dihydrooxazol-2-yl)-1-(3-phenylpropyl)-1H-1,2,3-triazole | CHEMBL249863
Type:
Small organic molecule
Emp. Form.:
C14H16N4O
Mol. Mass.:
256.303
SMILES:
C(Cc1ccccc1)Cn1cc(nn1)C1=NCCO1
: