Target
5-hydroxytryptamine receptor 7
Ligand
BDBM50371435
Substrate
Meas. Tech.
ChEMBL_463656 (CHEMBL930824)
Ki
793±n/a nM
Citation
 Peters, JULübbers, TAlanine, AKolczewski, SBlasco, FSteward, L Cyclic guanidines as dual 5-HT5A/5-HT7 receptor ligands: structure-activity relationship elucidation. Bioorg Med Chem Lett 18:256-61 (2008)  
Target
Name:
5-hydroxytryptamine receptor 7
Synonyms:
5-HT-7 5-HT7 5-HT7S 5HT7 HTR7 | Serotonin receptor 7
Type:
G Protein-Coupled Receptor (GPCR)
Mol. Mass.:
53573.08
Organism:
Homo sapiens (Human)
Description:
P34969
Residue:
479
  
Inhibitor
Name:
BDBM50371435
Synonyms:
CHEMBL401541 | CHEMBL556983
Type:
Small organic molecule
Emp. Form.:
C8H8ClN3
Mol. Mass.:
181.622
SMILES:
NC1=Nc2cccc(Cl)c2CN1
: