Target
5-hydroxytryptamine receptor 5A
Ligand
BDBM50371449
Substrate
Meas. Tech.
ChEMBL_463649 (CHEMBL930817)
Ki
658±n/a nM
Citation
 Peters, JULübbers, TAlanine, AKolczewski, SBlasco, FSteward, L Cyclic guanidines as dual 5-HT5A/5-HT7 receptor ligands: structure-activity relationship elucidation. Bioorg Med Chem Lett 18:256-61 (2008)  
Target
Name:
5-hydroxytryptamine receptor 5A
Synonyms:
5-HT-5 5-hydroxytryptamine receptor 5 (5-HT5) 5HT5A_HUMAN Serotonin (5-HT) receptor | Serotonin receptor 5A
Type:
Enzyme
Mol. Mass.:
40266.25
Organism:
Homo sapiens (Human)
Description:
P47898
Residue:
357
  
Inhibitor
Name:
BDBM50371449
Synonyms:
CHEMBL557381
Type:
Small organic molecule
Emp. Form.:
C8H9N3
Mol. Mass.:
147.1772
SMILES:
NC1=Nc2ccccc2CN1
: