Target
Cocaine esterase
Ligand
BDBM50371970
Substrate
Meas. Tech.
ChEMBL_464384 (CHEMBL930033)
IC50
5.8±n/a nM
Citation
 Wheelock, CENishi, KYing, AJones, PDColvin, MEOlmstead, MMHammock, BD Influence of sulfur oxidation state and steric bulk upon trifluoromethyl ketone (TFK) binding kinetics to carboxylesterases and fatty acid amide hydrolase (FAAH). Bioorg Med Chem 16:2114-30 (2008)  
Target
Name:
Cocaine esterase
Synonyms:
CES2 EST2_HUMAN | ICE
Type:
PROTEIN
Mol. Mass.:
61801.08
Organism:
Homo sapiens (Human)
Description:
ChEMBL_1494240
Residue:
559
  
Inhibitor
Name:
BDBM50371970
Synonyms:
CHEMBL89506
Type:
Small organic molecule
Emp. Form.:
C11H19F3OS
Mol. Mass.:
256.328
SMILES:
CCCCCCCCSCC(=O)C(F)(F)F
: