Target
Carbonic anhydrase 2
Ligand
BDBM50372659
Substrate
Meas. Tech.
ChEMBL_465606 (CHEMBL951056)
Ki
7.6±n/a nM
Citation
 Wilkinson, BLInnocenti, AVullo, DSupuran, CTPoulsen, SA Inhibition of carbonic anhydrases with glycosyltriazole benzene sulfonamides. J Med Chem 51:1945-53 (2008)  
Target
Name:
Carbonic anhydrase 2
Synonyms:
CA-II CAC Carbonate dehydratase II Carbonic anhydrase 2 (CA-II) Carbonic anhydrase C Carbonic anhydrase II (CA-II) Carbonic anhydrase II (hCA II) | Carbonic anhydrase isoenzyme II (hCA II)
Type:
Enzyme
Mol. Mass.:
29250.71
Organism:
Homo sapiens (Human)
Description:
P00918
Residue:
260
  
Inhibitor
Name:
BDBM50372659
Synonyms:
CHEMBL259682
Type:
Small organic molecule
Emp. Form.:
C14H18N4O7S
Mol. Mass.:
386.38
SMILES:
NS(=O)(=O)c1ccc(cc1)-c1cn(nn1)[C@H]1O[C@H](CO)[C@@H](O)[C@H](O)[C@@H]1O
: