Target
Broad substrate specificity ATP-binding cassette transporter ABCG2
Ligand
BDBM50234488
Substrate
Meas. Tech.
ChEMBL_465978 (CHEMBL931162)
EC50
500±n/a nM
Citation
 Colabufo, NABerardi, FPerrone, RRapposelli, SDigiacomo, MVanni, MBalsamo, A Synthesis and biological evaluation of (hetero)arylmethyloxy- and arylmethylamine-phenyl derivatives as potent P-glycoprotein modulating agents. J Med Chem 51:1415-22 (2008)  
Target
Name:
Broad substrate specificity ATP-binding cassette transporter ABCG2
Synonyms:
ABCG2 ABCP ATP-binding cassette sub-family G member 2 ATP-binding cassette, sub-family G, member 2 BCRP1 CDw338 Mitoxantrone resistance-associated protein Urate exporter
Type:
Multi-pass membrane protein; monomer or homodimer; disulfide-linked
Mol. Mass.:
72329.48
Organism:
Homo sapiens (Human)
Description:
Q9UNQ0
Residue:
655
  
Inhibitor
Name:
BDBM50234488
Synonyms:
CHEMBL272036 N-[(3,4-dimethoxy)benzyl]-2-[2-(3-methoxyphenyl)ethyl]aniline
Type:
Small organic molecule
Emp. Form.:
C24H27NO3
Mol. Mass.:
377.4761
SMILES:
COc1cccc(CCc2ccccc2NCc2ccc(OC)c(OC)c2)c1
: