Target
Adenosylhomocysteinase
Ligand
BDBM50373100
Substrate
Meas. Tech.
ChEMBL_466721 (CHEMBL937442)
IC50
2100±n/a nM
Citation
 Ando, TIwata, MZulfiqar, FMiyamoto, TNakanishi, MKitade, Y Synthesis of 2-modified aristeromycins and their analogs as potent inhibitors against Plasmodium falciparum S-adenosyl-L-homocysteine hydrolase. Bioorg Med Chem 16:3809-15 (2008)  
Target
Name:
Adenosylhomocysteinase
Synonyms:
AdoHcyase S-adenosyl-L-homocysteine hydrolase | SAHH_PLAF7
Type:
PROTEIN
Mol. Mass.:
53833.80
Organism:
Plasmodium falciparum 3D7
Description:
ChEMBL_196715
Residue:
479
  
Inhibitor
Name:
BDBM50373100
Synonyms:
CHEMBL262063
Type:
Small organic molecule
Emp. Form.:
C12H15N5O3
Mol. Mass.:
277.2792
SMILES:
Nc1ncnc2n(cnc12)[C@H]1[C@H](O)[C@H](O)[C@@H](CO)C1=C
: