Target
cGMP-inhibited 3',5'-cyclic phosphodiesterase 3B
Ligand
BDBM14764
Substrate
Meas. Tech.
ChEMBL_466944 (CHEMBL933709)
Ki
201±n/a nM
Citation
 Kulkarni, SSPatel, MRTalele, TT CoMFA and HQSAR studies on 6,7-dimethoxy-4-pyrrolidylquinazoline derivatives as phosphodiesterase10A inhibitors. Bioorg Med Chem 16:3675-86 (2008)  
Target
Name:
cGMP-inhibited 3',5'-cyclic phosphodiesterase 3B
Synonyms:
CGI-PDE B CGIPDE1 PDE3B Phosphodiesterase 3B Phosphodiesterase Type 3 (PDE3B) cGMP-inhibited 3,5-cyclic phosphodiesterase B
Type:
Enzyme
Mol. Mass.:
124318.95
Organism:
Homo sapiens (Human)
Description:
PDE3B was generated from the full-length recombinant human clone transfected into Sf9 cells.
Residue:
1112
  
Inhibitor
Name:
BDBM14764
Synonyms:
(R)-6,7-Dimethoxy-4-[3-(quinolin-6-yloxy)-pyrrolidin-1-yl]-quinazoline 6,7-dimethoxy-4-[(3R)-3-(quinolin-6-yloxy)pyrrolidin-1-yl]quinazoline
Type:
Small organic molecule
Emp. Form.:
C23H22N4O3
Mol. Mass.:
402.4458
SMILES:
COc1cc2ncnc(N3CC[C@H](C3)Oc3ccc4ncccc4c3)c2cc1OC
: