Target
Prostaglandin G/H synthase 2
Ligand
BDBM50373562
Substrate
Meas. Tech.
ChEMBL_468015 (CHEMBL947226)
IC50
12.7±n/a nM
Citation
 Orjales, AMosquera, RLópez, BOlivera, RLabeaga, LNúñez, MT Novel 2-(4-methylsulfonylphenyl)pyrimidine derivatives as highly potent and specific COX-2 inhibitors. Bioorg Med Chem 16:2183-99 (2008)  
Target
Name:
Prostaglandin G/H synthase 2
Synonyms:
COX2 Cyclooxygenase 2 (COX-2) Cyclooxygenase-2 (COX-2 AA) Cyclooxygenase-2 (COX-2) PGH2_HUMAN PHS II Prostaglandin E synthase/G/H synthase 2 Prostaglandin-endoperoxide synthase 2
Type:
Enzyme
Mol. Mass.:
69003.89
Organism:
Homo sapiens (Human)
Description:
Recombinant Cox-2 provided by Cayman (Cayman Chemical Co.,Ann Arbor, MI).
Residue:
604
  
Inhibitor
Name:
BDBM50373562
Synonyms:
CHEMBL270078
Type:
Small organic molecule
Emp. Form.:
C16H14ClN3O2S2
Mol. Mass.:
379.884
SMILES:
CS(=O)(=O)c1ccc(cc1)-c1nc(Cl)cc(NCc2cccs2)n1
: