Target
Chymase
Ligand
BDBM50374283
Substrate
Meas. Tech.
ChEMBL_469241 (CHEMBL948942)
Ki
3800±n/a nM
Citation
 Maryanoff, BECostanzo, MJ Inhibitors of proteases and amide hydrolases that employ an alpha-ketoheterocycle as a key enabling functionality. Bioorg Med Chem 16:1562-95 (2008)  
Target
Name:
Chymase
Synonyms:
Alpha-chymase CMA1_HUMAN CYM Mast cell protease I
Type:
Enzyme
Mol. Mass.:
27340.12
Organism:
Homo sapiens (Human)
Description:
Residue:
247
  
Inhibitor
Name:
BDBM50374283
Synonyms:
CHEMBL256462
Type:
Small organic molecule
Emp. Form.:
C24H20FN5O3S
Mol. Mass.:
477.511
SMILES:
Nc1cnc(-c2ccc(F)cc2)n(CC(=O)N[C@@H](Cc2ccccc2)C(=O)c2nccs2)c1=O
: