Target
Synaptic vesicular amine transporter
Ligand
BDBM50374533
Substrate
Meas. Tech.
ChEMBL_469572 (CHEMBL932301)
Ki
10000±n/a nM
Citation
 Wimalasena, DSPerera, RPHeyen, BJBalasooriya, ISWimalasena, K Vesicular monoamine transporter substrate/inhibitor activity of MPTP/MPP+ derivatives: a structure-activity study. J Med Chem 51:760-8 (2008)  
Target
Name:
Synaptic vesicular amine transporter
Synonyms:
Monoamine transporter Solute carrier family 18 member 2 VMAT2 Vesicular amine transporter 2
Type:
PROTEIN
Mol. Mass.:
55749.95
Organism:
Bos taurus
Description:
ChEMBL_469572
Residue:
517
  
Inhibitor
Name:
BDBM50374533
Synonyms:
CHEMBL411716
Type:
Small organic molecule
Emp. Form.:
C22H28N2O5
Mol. Mass.:
400.4681
SMILES:
CO[C@H]1[C@H](O)C[C@@H]2CN3CCc4c([nH]c5cc(OC)ccc45)[C@H]3C[C@@H]2[C@@H]1C(O)=O
: