Target
Delta-type opioid receptor
Ligand
BDBM50374634
Substrate
Meas. Tech.
ChEMBL_469678 (CHEMBL946806)
Ki
>1000±n/a nM
Citation
 Munro, TADuncan, KKXu, WWang, YLiu-Chen, LYCarlezon, WACohen, BMBéguin, C Standard protecting groups create potent and selective kappa opioids: salvinorin B alkoxymethyl ethers. Bioorg Med Chem 16:1279-86 (2008)  
Target
Name:
Delta-type opioid receptor
Synonyms:
DOR-1 MSL-2 OPRD_MOUSE Oprd1
Type:
Enzyme Catalytic Domain
Mol. Mass.:
40577.25
Organism:
MOUSE
Description:
P32300
Residue:
372
  
Inhibitor
Name:
BDBM50374634
Synonyms:
CHEMBL258098
Type:
Small organic molecule
Emp. Form.:
C23H30O8
Mol. Mass.:
434.4795
SMILES:
COCO[C@H]1C[C@@H](C(=O)OC)[C@]2(C)CC[C@H]3C(=O)O[C@@H](C[C@]3(C)[C@H]2C1=O)c1ccoc1
: